SANITÀ E ASSISTENZA SOCIALE
type: Concept
type: PrivateOrgActivityType
narrower: https://w3id.org/italia/controlled-vocabulary/classifications-for-organizations/ateco-2007/87
narrower: https://w3id.org/italia/controlled-vocabulary/classifications-for-organizations/ateco-2007/88
definition: Questa sezione include l'erogazione di servizi sanitari e le attività di assistenza sociale. àˆ inclusa una vasta gamma di attività , tra cui l'assistenza sanitaria fornita da medici professionisti presso ospedali e altre strutture, le attività di assistenza domiciliare che contemplano anche attività di assistenza sanitaria o attività di assistenza sociale che non contemplano il coinvolgimento degli operatori sanitari.
has rank order: 1
in scheme: ateco-2007
notation: Q
narrower: https://w3id.org/italia/controlled-vocabulary/classifications-for-organizations/ateco-2007/86