SANITÀ E ASSISTENZA SOCIALE
type: Concept
type: PrivateOrgActivityType
definition: Questa sezione include l'erogazione di servizi sanitari e le attività di assistenza sociale. àˆ inclusa una vasta gamma di attività , tra cui l'assistenza sanitaria fornita da medici professionisti presso ospedali e altre strutture, le attività di assistenza domiciliare che contemplano anche attività di assistenza sanitaria o attività di assistenza sociale che non contemplano il coinvolgimento degli operatori sanitari.
in scheme: ateco-2007
narrower: 87
narrower: 88
narrower: 86
notation: Q
has rank order: 1