ATTIVITÀ ARTISTICHE, SPORTIVE, DI INTRATTENIMENTO E DIVERTIMENTO
type: Concept
type: PrivateOrgActivityType
definition: Questa sezione include una vasta gamma di attività destinate a soddisfare diversi interessi culturali, di intrattenimento e divertimento per il pubblico, inclusi spettacoli dal vivo, gestione di musei, giochi e scommesse, attività sportive e ricreative.
has rank order: 1
in scheme: ateco-2007
narrower: https://w3id.org/italia/controlled-vocabulary/classifications-for-organizations/ateco-2007/92
narrower: https://w3id.org/italia/controlled-vocabulary/classifications-for-organizations/ateco-2007/93
narrower: https://w3id.org/italia/controlled-vocabulary/classifications-for-organizations/ateco-2007/90
narrower: https://w3id.org/italia/controlled-vocabulary/classifications-for-organizations/ateco-2007/91
notation: R