ALTRE ATTIVITÀ DI SERVIZI
type: Concept
notation: S
narrower: https://w3id.org/italia/controlled-vocabulary/classifications-for-organizations/ateco-2007/94
has rank order: 1
narrower: https://w3id.org/italia/controlled-vocabulary/classifications-for-organizations/ateco-2007/95
in scheme: ateco-2007
definition: Questa sezione include le attività di organizzazioni associative, la riparazione di computer e di beni per la casa e la persona e una varietà di servizi personali non altrove classificati
type: PrivateOrgActivityType
narrower: https://w3id.org/italia/controlled-vocabulary/classifications-for-organizations/ateco-2007/96