Ricerca & Sviluppo per i servizi pubblici generali
type: PublicOrgActivityType
type: Concept
type: ClassificationItem
has rank order: 3
definition: Amministrazione e funzionamento degli enti pubblici impegnati nella ricerca applicata e nello sviluppo sperimentale connessi ai servizi pubblici generali; sovvenzioni, prestiti o sussidi a sostegno della ricerca applicata e dello sviluppo sperimentale connessi ai servizi pubblici generali svolti da enti non statali quali istituti di ricerca e università.
broader transitive: https://w3id.org/italia/controlled-vocabulary/classifications-for-organizations/cofog-2009/01
broader: https://w3id.org/italia/controlled-vocabulary/classifications-for-organizations/cofog-2009/015
specializes: https://w3id.org/italia/controlled-vocabulary/classifications-for-organizations/cofog-2009/015
notation: 01.5.1
in scheme: cofog-2009