Ricerca & Sviluppo per i servizi pubblici generali
type: PublicOrgActivityType
type: Concept
type: ClassificationItem
specializes: 015
broader: 015
broader transitive: 01
definition: Amministrazione e funzionamento degli enti pubblici impegnati nella ricerca applicata e nello sviluppo sperimentale connessi ai servizi pubblici generali; sovvenzioni, prestiti o sussidi a sostegno della ricerca applicata e dello sviluppo sperimentale connessi ai servizi pubblici generali svolti da enti non statali quali istituti di ricerca e università.
in scheme: cofog-2009
notation: 01.5.1
has rank order: 3