Transazioni relative al debito pubblico
type: PublicOrgActivityType
type: Concept
broader: https://w3id.org/italia/controlled-vocabulary/classifications-for-organizations/cofog-2009/017
broader transitive: https://w3id.org/italia/controlled-vocabulary/classifications-for-organizations/cofog-2009/01
notation: 01.7.1
definition: Pagamento di interessi e spese per la sottoscrizione e l'emissione dei titoli del debito pubblico.
specializes: https://w3id.org/italia/controlled-vocabulary/classifications-for-organizations/cofog-2009/017
has rank order: 3
in scheme: cofog-2009
type: ClassificationItem