Trasferimenti a carattere generale tra diversi livelli di amministrazione
type: Concept
type: PublicOrgActivityType
type: ClassificationItem
in scheme: cofog-2009
broader transitive: https://w3id.org/italia/controlled-vocabulary/classifications-for-organizations/cofog-2009/01
specializes: https://w3id.org/italia/controlled-vocabulary/classifications-for-organizations/cofog-2009/018
notation: 01.8.1
has rank order: 3
broader: https://w3id.org/italia/controlled-vocabulary/classifications-for-organizations/cofog-2009/018
definition: Trasferimenti a carattere generale tra diversi livelli di amministrazione non destinati ad una funzione particolare.