Ricerca & Sviluppo per la Difesa
type: PublicOrgActivityType
type: ClassificationItem
type: Concept
specializes: https://w3id.org/italia/controlled-vocabulary/classifications-for-organizations/cofog-2009/024
broader transitive: https://w3id.org/italia/controlled-vocabulary/classifications-for-organizations/cofog-2009/02
broader: https://w3id.org/italia/controlled-vocabulary/classifications-for-organizations/cofog-2009/024
in scheme: cofog-2009
definition: Amministrazione e funzionamento degli enti pubblici impegnati nella ricerca applicata e nello sviluppo sperimentale relativo alla difesa; sovvenzioni, prestiti o sussidi a sostegno della ricerca applicata e dello sviluppo sperimentale relativi alla difesa e svolti da enti non statali quali istituti di ricerca e università .
has rank order: 3
notation: 02.4.1