Ricerca & Sviluppo per la Difesa
type: PublicOrgActivityType
type: ClassificationItem
type: Concept
specializes: 024
broader: 024
broader transitive: 02
definition: Amministrazione e funzionamento degli enti pubblici impegnati nella ricerca applicata e nello sviluppo sperimentale relativo alla difesa; sovvenzioni, prestiti o sussidi a sostegno della ricerca applicata e dello sviluppo sperimentale relativi alla difesa e svolti da enti non statali quali istituti di ricerca e università .
in scheme: cofog-2009
notation: 02.4.1
has rank order: 3