Difesa non altrove classificata
type: ClassificationItem
type: PublicOrgActivityType
type: Concept
has rank order: 3
broader transitive: https://w3id.org/italia/controlled-vocabulary/classifications-for-organizations/cofog-2009/02
broader: https://w3id.org/italia/controlled-vocabulary/classifications-for-organizations/cofog-2009/025
definition: Amministrazione, funzionamento o attività di sostegno relative alla difesa che non rientrano nei gruppi (02.1), (02.2), (02.3) oppure (02.4); attivitÃ quali formulazione, amministrazione, coordinamento e monitoraggio delle politiche, dei piani, dei programmi e dei bilanci relativi alla difesa in generale; predisposizione e attuazione della legislazione relativa alla difesa; produzione e diffusione di informazioni generali, documentazione tecnica e statistiche sulla difesa; ecc.
specializes: https://w3id.org/italia/controlled-vocabulary/classifications-for-organizations/cofog-2009/025
in scheme: cofog-2009
notation: 02.5.1