Tribunali
type: Concept
type: ClassificationItem
type: PublicOrgActivityType
in scheme: cofog-2009
notation: 03.3.1
broader: https://w3id.org/italia/controlled-vocabulary/classifications-for-organizations/cofog-2009/033
broader transitive: https://w3id.org/italia/controlled-vocabulary/classifications-for-organizations/cofog-2009/03
has rank order: 3
definition: Amministrazione, funzionamento o supporto ai tribunali civili e penali e al sistema giudiziario, compresa l'applicazione di sanzioni e di concordati impostidai tribunali e funzionamento dei sistemi di libertÃ sulla parola e di libertÃ vigilata; rappresentanza e consulenza legale per conto dello Stato o di altri, offerta, in denaro o in servizi, dal governo stesso.
specializes: https://w3id.org/italia/controlled-vocabulary/classifications-for-organizations/cofog-2009/033