Ricerca & Sviluppo connessi all'ordine pubblico e sicurezza
type: PublicOrgActivityType
type: ClassificationItem
type: Concept
in scheme: cofog-2009
broader transitive: https://w3id.org/italia/controlled-vocabulary/classifications-for-organizations/cofog-2009/03
specializes: https://w3id.org/italia/controlled-vocabulary/classifications-for-organizations/cofog-2009/035
has rank order: 3
definition: Amministrazione e funzionamento degli enti pubblici impegnati nella ricerca applicata e nello sviluppo sperimentale connessi all'ordine pubblico e sicurezza; sovvenzioni, prestiti o sussidi a supporto della ricerca applicata e dello sviluppo sperimentale connessi all'ordine pubblico e sicurezza e svolti da enti non statali quali istituti di ricerca ed università.
notation: 03.5.1
broader: https://w3id.org/italia/controlled-vocabulary/classifications-for-organizations/cofog-2009/035