Ricerca & Sviluppo connessi all'ordine pubblico e sicurezza
type: PublicOrgActivityType
type: ClassificationItem
type: Concept
specializes: 035
broader: 035
broader transitive: 03
definition: Amministrazione e funzionamento degli enti pubblici impegnati nella ricerca applicata e nello sviluppo sperimentale connessi all'ordine pubblico e sicurezza; sovvenzioni, prestiti o sussidi a supporto della ricerca applicata e dello sviluppo sperimentale connessi all'ordine pubblico e sicurezza e svolti da enti non statali quali istituti di ricerca ed università.
in scheme: cofog-2009
notation: 03.5.1
has rank order: 3