Affari generali economici e commerciali
type: Concept
type: ClassificationItem
type: PublicOrgActivityType
specializes: 041
broader: 041
broader transitive: 04
definition: Amministrazione degli affari e dei servizi economici e commerciali generali, inclusi gli affari generali di commercio con l'estero; formulazione e attuazione delle politiche economiche e commerciali generali; collegamento fra le diverse branche del governo e fra governo e mondo economico; regolamentazione o supporto alle attivitÃ economiche e commerciali in generale quali gli scambi import-export nel complesso, mercato delle materie prime e azionario, controlli sul reddito complessivo, sviluppo del commercio, regolamentazione generale dei monopoli e altre limitazioni agli scambi e alle importazioni, ecc.; vigilanza sul settore bancario; funzionamento o supporto alle istituzioni che trattano di brevetti, marchi di fabbrica, diritti d'autore, previsioni meteorologiche, normative, rilevamenti idrologici e geodesici, ecc.; sovvenzioni, prestiti o sussidi per la promozione delle politiche e dei programmi generali economici e commerciali.
in scheme: cofog-2009
notation: 04.1.1
has rank order: 3