Affari generali del lavoro
type: ClassificationItem
type: Concept
type: PublicOrgActivityType
broader: https://w3id.org/italia/controlled-vocabulary/classifications-for-organizations/cofog-2009/041
in scheme: cofog-2009
definition: Amministrazione degli affari e dei servizi generali del lavoro; formulazione e attuazione delle politiche generali del lavoro; vigilanza e regolamentazione delle condizioni lavorative (orari, retribuzioni, sicurezza, ecc.); collegamento tra le diverse branche dell'amministrazione pubblica e le organizzazioni generali dell'industria, del commercio e del lavoro; funzionamento o supporto ai programmi o ai progetti generali per facilitare la mobilitÃ del lavoro, per combattere le discriminazioni di sesso, razza, etÃ o di altro genere, per ridurre il tasso di disoccupazione nelle regioni depresse o sottosviluppate, per promuovere l'occupazione di soggetti svantaggiati o di altri gruppi caratterizzati da alti tassi di disoccupazione, ecc.; funzionamento degli uffici di collocamento, funzionamento o supporto ai servizi di arbitrato e mediazione; produzione e diffusione di informazioni generali, documentazione tecnica e statistiche relative alle attività e ai servizi del lavoro; prestiti, sussidi o sovvenzioni per promuovere le politiche e i programmi generali del lavoro.
specializes: https://w3id.org/italia/controlled-vocabulary/classifications-for-organizations/cofog-2009/041
has rank order: 3
notation: 04.1.2
broader transitive: https://w3id.org/italia/controlled-vocabulary/classifications-for-organizations/cofog-2009/04