Carbone ed altri combustibili solidi minerali
type: Concept
type: ClassificationItem
type: PublicOrgActivityType
broader transitive: https://w3id.org/italia/controlled-vocabulary/classifications-for-organizations/cofog-2009/04
specializes: https://w3id.org/italia/controlled-vocabulary/classifications-for-organizations/cofog-2009/043
has rank order: 3
definition: Questa classe comprende carbone di qualsiasi qualità, lignite e torba indipendentemente dai metodi usati per la loro estrazione, o miglioramento e trasformazione di questi combustibili in altre forme quali coke o gas. Amministrazione delle attività e servizi connessi con combustibili solidi minerali; tutela, scoperta, sviluppo e sfruttamento razionale delle risorse di combustibili solidi minerali; vigilanza e regolamentazione dell'estrazione, della trasformazione, distribuzione e utilizzo dei combustibili solidi minerali; produzione e diffusione di informazioni generali, documentazione tecnica e statistiche su attività e servizi relativi ai combustibili solidi minerali; sovvenzioni, prestiti o sussidi a supporto dell'industria dei combustibili solidi minerali e di coke, di mattoni o del gas lavorato.
in scheme: cofog-2009
notation: 04.3.1
broader: https://w3id.org/italia/controlled-vocabulary/classifications-for-organizations/cofog-2009/043