Attività manifatturiere
type: ClassificationItem
type: PublicOrgActivityType
type: Concept
definition: Amministrazione delle attivitò e servizi manifatturieri; sviluppo, espansione o miglioramento della manifattura; vigilanza e regolamentazione degli stabilimenti e del funzionamento degli impianti; collegamenti con le associazioni di categoria e le altre organizzazioni interessate nelle attività e servizi manifatturieri; produzione e diffusione di informazioni generali, documentazione tecnica e statistiche sulle attività manifatturiere e sui prodotti; sovvenzioni, prestiti o sussidi a sostegno delle imprese manifatturiere.
in scheme: cofog-2009
broader: https://w3id.org/italia/controlled-vocabulary/classifications-for-organizations/cofog-2009/044
broader transitive: https://w3id.org/italia/controlled-vocabulary/classifications-for-organizations/cofog-2009/04
specializes: https://w3id.org/italia/controlled-vocabulary/classifications-for-organizations/cofog-2009/044
notation: 04.4.2
has rank order: 3