Attività edilizia
type: PublicOrgActivityType
type: ClassificationItem
type: Concept
broader: https://w3id.org/italia/controlled-vocabulary/classifications-for-organizations/cofog-2009/044
definition: Amministrazione delle attività e servizi relativi all'edilizia; vigilanza sull'industria edile; sviluppo e regolamentazione degli standard edilizi; produzione e diffusione di informazioni generali, documentazione tecnica e statistiche su attività e servizi edili.
in scheme: cofog-2009
notation: 04.4.3
broader transitive: https://w3id.org/italia/controlled-vocabulary/classifications-for-organizations/cofog-2009/04
specializes: https://w3id.org/italia/controlled-vocabulary/classifications-for-organizations/cofog-2009/044