Attività edilizia
type: PublicOrgActivityType
type: ClassificationItem
type: Concept
specializes: 044
broader: 044
broader transitive: 04
definition: Amministrazione delle attività e servizi relativi all'edilizia; vigilanza sull'industria edile; sviluppo e regolamentazione degli standard edilizi; produzione e diffusione di informazioni generali, documentazione tecnica e statistiche su attività e servizi edili.
in scheme: cofog-2009
notation: 04.4.3