Trasporti per vie d'acqua
type: PublicOrgActivityType
type: Concept
type: ClassificationItem
specializes: 045
broader: 045
broader transitive: 04
definition: Amministrazione delle attività e dei servizi connessi al funzionamento, utilizzo, costruzione e manutenzione dei sistemi e delle infrastrutture per il trasporto per vie d'acqua interno, costiero e oceanico (porti, moli, aiuti alla navigazione, canali naturali e artificiali, frangiflutti, pontili, banchine, terminali ecc.); vigilanza e regolamentazione dell'utenza del trasporto per vie d'acqua (registrazione, autorizzazioni e ispezioni di imbarcazioni ed equipaggi, regolamentazione sulla sicurezza dei passeggeri e delle merci ecc.), delle operazioni dei sistemi di trasporto per vie d'acqua (concessione di licenze, approvazione delle tariffe per il trasporto merci e passeggeri e delle frequenze del servizio, ecc.) e della costruzione e manutenzione delle infrastrutture del trasporto per vie d'acqua; costruzione o funzionamento delle infrastr. e dei sistemi di trasporto per vie d'acqua diversi da quelli utilizzati per l'industria (quali i traghetti); produzione e diffusione di informazioni generali, documentazione tecnica e statistiche sulle operazioni e sulle attività di costruzione delle infrastr. relative al trasporto per vie d’acqua; sovvenzioni, prestiti o sussidi a sostegno del funzionamento, della costruzione, della manutenzione o del miglioramento delle infrastr. e dei sistemi di trasporto per vie d’acqua. Incluso: supporto per la navigazione radio e satellitare; salvataggio d'emergenza e servizi di rimorchio. Escluso: autorità doganali (01.1.2); aiuti alla navigazione forniti dalla guardia costiera (03.1.1); controllo del traffico per vie d’acqua (03.1.1); sovvenzioni, prestiti o sussidi ai costruttori navali (04.4.2).
in scheme: cofog-2009
notation: 04.5.2
has rank order: 3