Trasporti su rotaia
type: Concept
type: ClassificationItem
type: PublicOrgActivityType
specializes: https://w3id.org/italia/controlled-vocabulary/classifications-for-organizations/cofog-2009/045
has rank order: 3
in scheme: cofog-2009
broader: https://w3id.org/italia/controlled-vocabulary/classifications-for-organizations/cofog-2009/045
broader transitive: https://w3id.org/italia/controlled-vocabulary/classifications-for-organizations/cofog-2009/04
notation: 04.5.3
definition: Amministrazione delle attività e servizi connessi al funzionamento, utilizzo, costruzione e manutenzione dei sistemi e delle infrastrutture per il trasporto su rotaia (massicciate ferroviarie, terminali, gallerie, ponti, argini, trincee ferroviarie, ecc.); vigilanza e regolamentazione dell'utenza del trasporto su rotaia (condizione del materiale rotabile, stabilità delle massicciate, sicurezza dei passeggeri e delle merci, ecc.), delle operazioni del sistema di trasporto su rotaia (concessione di licenze, approvazione delle tariffe per il trasporto merci e passeggeri e delle frequenze del servizio, ecc.) e della costruzione e manutenzione della rete ferroviaria; funzionamento delle infrastrutture e del sistema di trasporto su rotaia diversi da quelli utilizzati per l'industria; produzione e diffusione di informazioni generali, documentazione tecnica e statistiche sulle operazioni e sulle attività di costruzione relative al trasporto su rotaia; sovvenzioni, prestiti o sussidi a sostegno del funzionamento, della costruzione, della manutenzione o del miglioramento delle infrastrutture e del sistema di trasporto su rotaia. Incluso: sistemi di trasporto su rotaia interurbani e a lunga percorrenza, sistemi di trasporto tranviario; acquisto e manutenzione di materiale rotabile. Escluso: sovvenzioni, prestiti e sussidi ai produttori di materiale rotabile (04.4.2); costruzione di argini anti-rumore, barriere ed altre strutture compreso il rifacimento di porzioni di strade ferrate con rivestimenti anti-rumore (05.3.1).