Trasporti aerei
type: Concept
type: ClassificationItem
type: PublicOrgActivityType
specializes: 045
broader: 045
broader transitive: 04
definition: Amministrazione delle attività e dei servizi connessi al funzionamento, utilizzo, costruzione e manutenzione dei sistemi e delle infrastrutture per il trasporto aereo (aeroporti, piste di decollo e atterraggio, terminal, hangar, aiuti alla navigazione aerea e altre strutture per il trasporto aereo); vigilanza e regolamentazione dell'utenza del trasporto aereo registrazione, autorizzazioni e ispezioni degli aeromobili, dei piloti, degli equipaggi, del personale di terra, norme sulla sicurezza dei passeggeri, indagini sugli incidenti aerei, ecc.), delle operazioni del sistema di trasporto aereo (attribuzione di rotte, approvazione delle tariffe per il trasporto merci e passeggeri e delle frequenze e del livello del servizio, ecc.) e della costruzione e manutenzione delle infrastrutture del trasporto aereo; costruzione o funzionamento delle infrastrutture e dei servizi del rasporto aereo pubblico diversi da quelli utilizzati per l'industria; produzione e diffusione di informazioni generali, documentazione tecnica e statistiche sulle operazioni e sulle attività di costruzione relative al trasporto aereo e alla costruzione di infrastrutture; sovvenzioni, prestiti o sussidi a sostegno del funzionamento, della costruzione, della manutenzione o del miglioramento delle infrastrutture e del sistema di trasporto aereo. Incluso: supporto per la navigazione radio e satellitare; salvataggio d'emergenza; servizi di linea e non di linea per il trasporto merci e passeggeri; regolamentazione e controllo dei voli privati; manutenzione e riparazione delle strutture di controllo aereo e delle attrezzature di volo. Escluso: sovvenzioni, prestiti e sussidi ai costruttori di aeromobili (04.4.2).
in scheme: cofog-2009
notation: 04.5.4
has rank order: 3