Comunicazioni
type: Concept
type: ClassificationItem
type: PublicOrgActivityType
specializes: 046
broader: 046
broader transitive: 04
definition: Amministrazione delle attività e dei servizi relativi alla costruzione, ampliamento, miglioramento, funzionamento e manutenzione dei sistemi di comunicazione (postali, telefonici, telegrafici, senza fili, satellitari); regolamentazione delle operazioni relative al sistema delle comunicazioni (concessione di licenze; assegnazione delle frequenze, specificazione dei mercati che devono essere serviti e delle tariffe da applicare, ecc.); produzione e diffusione di informazioni generali, documentazione tecnica e statistiche sui servizi e sulle attivitÃ connesse alle comunicazioni; sovvenzioni, prestiti o sussidi a sostegno della costruzione, del funzionamento, della manutenzione o del miglioramento dei sistemi di comunicazione.
in scheme: cofog-2009
notation: 04.6.1
has rank order: 3