R&S per attività estrattive, manifatturiere ed edilizie
type: PublicOrgActivityType
type: ClassificationItem
type: Concept
broader: https://w3id.org/italia/controlled-vocabulary/classifications-for-organizations/cofog-2009/048
notation: 04.8.4
definition: Amministrazione e funzionamento degli enti pubblici impegnati nella ricerca applicata e nello sviluppo sperimentale connesse con attivitÃ estrattive, manifatturiere ed edilizie; sovvenzioni, prestiti o sussidi a supporto della ricerca applicata e dello sviluppo sperimentale connesse con attività estrattive, manifatturiere ed edilizie svolti da enti non statali quali istituti di ricerca ed università.
specializes: https://w3id.org/italia/controlled-vocabulary/classifications-for-organizations/cofog-2009/048
has rank order: 3
broader transitive: https://w3id.org/italia/controlled-vocabulary/classifications-for-organizations/cofog-2009/04
in scheme: cofog-2009