R&S per trasporti
type: ClassificationItem
type: Concept
type: PublicOrgActivityType
in scheme: cofog-2009
specializes: https://w3id.org/italia/controlled-vocabulary/classifications-for-organizations/cofog-2009/048
broader transitive: https://w3id.org/italia/controlled-vocabulary/classifications-for-organizations/cofog-2009/04
definition: Amministrazione e funzionamento degli enti pubblici impegnati nella ricerca applicata e nello sviluppo sperimentale relativi ai trasporti; sovvenzioni, prestiti o sussidi a supporto della ricerca applicata e dello sviluppo sperimentale relativi ai trasporti svolti da enti non statali quali istituti di ricerca ed università.
has rank order: 3
notation: 04.8.5
broader: https://w3id.org/italia/controlled-vocabulary/classifications-for-organizations/cofog-2009/048