R&S per trasporti
type: ClassificationItem
type: Concept
type: PublicOrgActivityType
specializes: 048
broader: 048
broader transitive: 04
definition: Amministrazione e funzionamento degli enti pubblici impegnati nella ricerca applicata e nello sviluppo sperimentale relativi ai trasporti; sovvenzioni, prestiti o sussidi a supporto della ricerca applicata e dello sviluppo sperimentale relativi ai trasporti svolti da enti non statali quali istituti di ricerca ed università.
in scheme: cofog-2009
notation: 04.8.5
has rank order: 3