Riduzione dell'inquinamento
type: ClassificationItem
type: Concept
type: PublicOrgActivityType
specializes: 053
broader: 053
broader transitive: 05
definition: Questa classe comprende le attività relative alla tutela dell'aria e del clima, del terreno e delle acque sotterranee, la riduzione dell'inquinamento acustico e delle vibrazioni, la protezione dalle radiazioni. Queste attività comprendono la costruzione, la manutenzione e il funzionamento dei sistemi e delle stazioni di monitoraggio (escluse le stazioni meteorologiche); la costruzione di argini, barriere ed altre strutture anti-rumore compreso il rifacimento di tratti di autostrade urbane o di ferrovie con materiali che riducono l'inquinamento acustico; le misure per il risanamento delle acque; le misure per controllare o prevenire le emissioni di gas che causano l'effetto serra e delle sostanze inquinanti che incidono negativamente sulla qualità dell'aria; la costruzione, la manutenzione e il funzionamento di impianti per la decontaminazione di terreni inquinati e per il deposito di prodotti inquinanti; il trasporto di prodotti inquinanti. Amministrazione, vigilanza, ispezione, funzionamento o supporto delle attività collegate alla riduzione e al controllo dell'inquinamento; sovvenzioni, prestiti o sussidi a sostegno delle attività collegate alla riduzione e al controllo dell’inquinamento.
in scheme: cofog-2009
notation: 05.3.1
has rank order: 3