Sviluppo delle abitazioni
type: Concept
type: PublicOrgActivityType
type: ClassificationItem
has rank order: 3
broader transitive: https://w3id.org/italia/controlled-vocabulary/classifications-for-organizations/cofog-2009/06
definition: Amministrazione delle attività e dei servizi relativi allo sviluppo delle abitazioni; promozione, monitoraggio e valutazione delle attività di sviluppo abitativo (siano o meno promosse dalle pubbliche autorità); sviluppo e regolamentazione degli standard edilizi; bonifica dei bassifondi collegata alla fornitura di alloggi; acquisizione di terreni per la costruzione di abitazioni; costruzione o acquisto e ristrutturazione di unità abitative destinate alla collettività o a soggetti con particolari necessità; produzione e diffusione di informazioni al pubblico, documentazione tecnica e statistiche sulle attività e sui servizi relativi allo sviluppo delle abitazioni; sovvenzioni, prestiti o sussidi a sostegno dell'espansione, del miglioramento o della manutenzione delle abitazioni.
in scheme: cofog-2009
broader: https://w3id.org/italia/controlled-vocabulary/classifications-for-organizations/cofog-2009/061
specializes: https://w3id.org/italia/controlled-vocabulary/classifications-for-organizations/cofog-2009/061
notation: 06.1.1