Ricerca & Sviluppo per abitazioni e assetto territoriale
type: PublicOrgActivityType
type: ClassificationItem
type: Concept
has rank order: 3
in scheme: cofog-2009
broader transitive: https://w3id.org/italia/controlled-vocabulary/classifications-for-organizations/cofog-2009/06
broader: https://w3id.org/italia/controlled-vocabulary/classifications-for-organizations/cofog-2009/065
specializes: https://w3id.org/italia/controlled-vocabulary/classifications-for-organizations/cofog-2009/065
notation: 06.5.1
definition: Amministrazione e funzionamento degli enti pubblici impegnati nella ricerca applicata e nello sviluppo sperimentale relativo allo sviluppo delle abitazioni e all'assetto territoriale; sovvenzioni, prestiti o sussidi a supporto della ricerca applicata e dello sviluppo sperimentale connessi allo sviluppo delle abitazioni e all'assetto territoriale svolti da enti non statali quali istituti di ricerca ed università.