Servizi medici generici
type: PublicOrgActivityType
type: Concept
type: ClassificationItem
specializes: 072
broader: 072
broader transitive: 07
definition: Questa classe comprende i servizi forniti da cliniche di medicina generale e da medici generici. Le cliniche di medicina generale sono definite come istituzioni che forniscono soprattutto servizi per pazienti esterni non limitati a particolari specialità mediche e che sono forniti principalmente da medici qualificati; i medici generici sono da intendere come medici senza una particolare specializzazione medica. Fornitura di servizi medici generali a pazienti non ospedalizzati; amministrazione, ispezione, funzionamento o sostegno ai servizi medici generali forniti dalle cliniche di medicina generale e dai medici generici.
in scheme: cofog-2009
notation: 07.2.1
has rank order: 3