Ricerca & Sviluppo per la sanità
type: ClassificationItem
type: PublicOrgActivityType
type: Concept
has rank order: 3
notation: 07.5.1
broader transitive: https://w3id.org/italia/controlled-vocabulary/classifications-for-organizations/cofog-2009/07
in scheme: cofog-2009
broader: https://w3id.org/italia/controlled-vocabulary/classifications-for-organizations/cofog-2009/075
definition: Amministrazione e funzionamento degli enti pubblici impegnati nella ricerca applicata e nello sviluppo sperimentale relativo alla sanità; sovvenzioni, prestiti e sussidi a supporto della ricerca applicata e dello sviluppo sperimentale relativi alla sanità svolti da enti non governativi quali istituti di ricerca ed università .
specializes: https://w3id.org/italia/controlled-vocabulary/classifications-for-organizations/cofog-2009/075