Servizi radiotelevisivi e di editoria
type: PublicOrgActivityType
specializes: https://w3id.org/italia/controlled-vocabulary/classifications-for-organizations/cofog-2009/083
notation: 08.3.1
has rank order: 3
broader transitive: https://w3id.org/italia/controlled-vocabulary/classifications-for-organizations/cofog-2009/08
in scheme: cofog-2009
broader: https://w3id.org/italia/controlled-vocabulary/classifications-for-organizations/cofog-2009/083
definition: Amministrazione delle attività radiotelevisive e di editoria; vigilanza e regolamentazione dei servizi radiotelevisivi e di editoria; funzionamento o sostegno ai servizi radiotelevisivi e di editoria; sovvenzioni, prestiti o sussidi a sostegno di: costruzione o acquisizione di strutture per la diffusione radiotelevisiva; costruzione o acquisizione di impianti, attrezzature o materiali per la pubblicazione di giornali, riviste o libri; produzione di materiale per, e sua presentazione attraverso, il sistema radiotelevisivo; raccolta di notizie o di altre informazioni; distribuzione di opere editoriali.
type: ClassificationItem
type: Concept