Attività ricreative, culturali e di culto non altrove classificate
type: ClassificationItem
type: Concept
definition: Amministrazione, funzionamento o attività di sostegno ai servizi ricreativi, culturali e di culto che non rientrano nei gruppi (08.1), (08.2), (08.3), (08.4) o (08.5); attività quali la formulazione, l'amministrazione, il coordinamento e il monitoraggio delle politiche, dei piani, dei programmi e dei bilanci per la promozione dello sport, delle attività ricreative, culturali e di culto in generale, predisposizione e attuazione della legislazione e della normativa per l'erogazione di servizi ricreativi e culturali; produzione e diffusione di informazioni generali, documentazione tecnica e statistiche sulle attività ricreative, culturali e di culto.
type: PublicOrgActivityType
specializes: https://w3id.org/italia/controlled-vocabulary/classifications-for-organizations/cofog-2009/086
notation: 08.6.1
broader: https://w3id.org/italia/controlled-vocabulary/classifications-for-organizations/cofog-2009/086
broader transitive: https://w3id.org/italia/controlled-vocabulary/classifications-for-organizations/cofog-2009/08
in scheme: cofog-2009
has rank order: 3