Istruzione secondaria inferiore
type: Concept
type: PublicOrgActivityType
type: ClassificationItem
in scheme: cofog-2009
definition: Erogazione di istruzione secondaria inferiore al livello ISCED-97 " 2" (Scuola secondaria inferiore); amministrazione, ispezione, funzionamento o sostegno a scuole e altre istituzioni che erogano istruzione secondaria inferiore al livello ISCED-97 "2"; borse di studio sovvenzioni, prestiti e indennità a sostegno di allievi che frequentano corsi di istruzione secondaria inferiore al livello ISCED-97 "2".
broader transitive: https://w3id.org/italia/controlled-vocabulary/classifications-for-organizations/cofog-2009/09
broader: https://w3id.org/italia/controlled-vocabulary/classifications-for-organizations/cofog-2009/092
notation: 09.2.1
specializes: https://w3id.org/italia/controlled-vocabulary/classifications-for-organizations/cofog-2009/092
has rank order: 3