Primo grado di istruzione superiore
type: ClassificationItem
in scheme: cofog-2009
has rank order: 3
specializes: https://w3id.org/italia/controlled-vocabulary/classifications-for-organizations/cofog-2009/094
broader transitive: https://w3id.org/italia/controlled-vocabulary/classifications-for-organizations/cofog-2009/09
definition: Erogazione di istruzione superiore al livello ISCED-97 "5" (Università); amministrazione, ispezione, funzionamento o sostegno a università e altre istituzioni che erogano istruzione superiore al livello ISCED-97 "5"; borse di studio sovvenzioni, prestiti e indennità a sostegno di studenti che frequentano corsi di istruzione superiore ai livelli ISCED-97 "5".
type: PublicOrgActivityType
notation: 09.4.1
type: Concept
broader: https://w3id.org/italia/controlled-vocabulary/classifications-for-organizations/cofog-2009/094