Superstiti
type: Concept
type: ClassificationItem
type: PublicOrgActivityType
broader: https://w3id.org/italia/controlled-vocabulary/classifications-for-organizations/cofog-2009/103
specializes: https://w3id.org/italia/controlled-vocabulary/classifications-for-organizations/cofog-2009/103
broader transitive: https://w3id.org/italia/controlled-vocabulary/classifications-for-organizations/cofog-2009/10
has rank order: 3
notation: 10.3.1
definition: Erogazione di protezione sociale nella forma di indennità in denaro o in natura a favore di superstiti di persone decedute (coniuge, ex- coniuge, figli, nipoti, genitori o altri parenti); amministrazione, funzionamento o sostegno a questi piani di protezione sociale; indennità in danaro, quali pensioni di reversibilità, sovvenzioni in seguito a decessi, altri pagamenti periodici o una tantum ai superstiti; indennità in natura, quali pagamenti per spese funebri, servizi e beni di vario genere erogati a favore di superstiti per consentire loro di partecipare alla vita della collettività.
in scheme: cofog-2009