User ID and password
type: Concept
type: Authentication
broader: SFA
definition: Simple credential consisting in username and password. Access to online Italian systems such as NoiPA and Fiscoonline and any other system that requires username and password fall into this category
definition: Credenziale semplice basata sull'uso di username e password. Accesso tramite sistemi quali NoiPA, FiscoOnline e ogni altro sistema che richiede solo credenziali di tipo usernname e password ricadono in questa categoria @it
in scheme: authentication-type
notation: IDPWD
preferred label: User ID e password @it
preferred label: Benutzer-ID und Passwort @de
has rank order: 2