Direct non-electronic
type: Concept
type: Channel
narrower: https://w3id.org/italia/controlled-vocabulary/classifications-for-public-services/channel/0111
narrower: https://w3id.org/italia/controlled-vocabulary/classifications-for-public-services/channel/0112
narrower: https://w3id.org/italia/controlled-vocabulary/classifications-for-public-services/channel/0113
preferred label: Nicht-direkte Telematik @de
preferred label: Non telematico diretto @it
definition: There is a direct face-to-face contact between the end-user and the PA
definition: Vi è un contatto diretto face-to-face tra utente finale e PA @it
in scheme: channel
broader: https://w3id.org/italia/controlled-vocabulary/classifications-for-public-services/channel/01
notation: 01.1
has rank order: 2