Applicazione con modulo precompilato
type: Concept
type: Channel
broader: 02
definition: Applicazione software che include un modulo online che ha almeno un campo già compilato automaticamente, senza la necessità per l'utente di inserire un valore
definition: Software application including an online module where at least one field is already filled in automatically without the need for the user to insert any value @en
in scheme: channel
notation: 02.2
preferred label: Vorkompiliertes Online-Modul @de
preferred label: Softwareapplikation mit vorkompiliertes Modul @en
has rank order: 2