Web Application
type: Concept
type: Channel
broader: 02
definition: Any software application usable via web protocols
definition: Qualsiasi applicazione usabile attraverso protocolli web. @it
in scheme: channel
notation: 02.3
preferred label: Web-Applikation @de
preferred label: Applicazione Web @it
has rank order: 2