Applicazione Desktop
type: Concept
type: Channel
broader: 02
definition: Qualsiasi applicazione software che può essere installata su un computer.
definition: Any software application that can be installed on a computer @en
in scheme: channel
notation: 02.4
preferred label: Desktop-Applikation @de
preferred label: Desktop Application @en
has rank order: 2