Mobile app
type: Concept
type: Channel
broader: 02
definition: Any software application that is installed on a mobile device
definition: Qualsiasi applicazione software che può essere installata su un dispositivo mobile. @it
in scheme: channel
notation: 02.5
preferred label: Mobile Anwendung @de
preferred label: App mobile @it
has rank order: 2