Pre-authorised payment
type: Concept
type: Channel
broader: https://w3id.org/italia/controlled-vocabulary/classifications-for-public-services/channel/054
preferred label: Incasso preautorizzato @it
preferred label: Vorautorisierte Zahlung @de
has rank order: 3
notation: 05.4.2
definition: Post-poned payment with respect to the provision of the service by the PA through its portal
definition: Pagamento differito rispetto all’erogazione del servizio da parte della PA tramite il suo portale @it
broader transitive: https://w3id.org/italia/controlled-vocabulary/classifications-for-public-services/channel/05
in scheme: channel