Chiusura impresa e attività professionale
type: Concept
in scheme: business-event
notation: 10
definition: Questo evento della vita di un'impresa raggruppa servizi pubblici relativi alla chiusura di un'impresa o di una attività professionale svolta da singoli professionisti.
has rank order: 1
preferred label: Schließung eines Unternehmens / einer beruflichen Tätigkeit @de
definition: This business event groups public services that relate to the closing, deregistration, discontinuation, of a company or business activity carried out by a single professional. @en
preferred label: Closing a company/a professional activity @en
type: BusinessEvent