Chiusura filiale
type: Concept
type: BusinessEvent
definition: Questo evento della vita di un'impresa raggruppa servizi pubblici relativi alla chiusura di una filiale di un'impresa.
definition: This business event groups public services related to the closing of a branch of a company. @en
in scheme: business-event
notation: 11
preferred label: Filiale schließen @de
preferred label: Closing a branch @en
has rank order: 1