Ristrutturazione impresa
type: BusinessEvent
preferred label: Umstrukturierung eines Unternehmens @de
preferred label: Restructuring company @en
type: Concept
in scheme: business-event
definition: Questo evento della vita di un'impresa raggruppa servizi pubblici relativi alla riorganizzazione, fusione, acquisizione e qualsiasi cambiamento dello stato legale di un'impresa.
definition: This business event groups public services related to the reorganisation, merger, acquisition, any change on the legal status of the business. @en
has rank order: 1
notation: 12