Bancarotta
type: BusinessEvent
type: Concept
preferred label: Bankrott @de
preferred label: Bankruptcy @en
notation: 14
definition: This business event groups public services that relate to declaration of bankruptcy of a company. @en
definition: Questo evento della vita di un'impresa raggruppa servizi pubblici relativi alla dichiarazione di stato di bancarotta per un'impresa
in scheme: business-event
has rank order: 1