Bankruptcy
type: BusinessEvent
type: Concept
definition: This business event groups public services that relate to declaration of bankruptcy of a company.
definition: Questo evento della vita di un'impresa raggruppa servizi pubblici relativi alla dichiarazione di stato di bancarotta per un'impresa @it
in scheme: business-event
notation: 14
preferred label: Bankrott @de
preferred label: Bancarotta @it
has rank order: 1