Participating in public procurement (national and cross-border)
type: BusinessEvent
type: Concept
definition: This business event groups public services related to participating in a public tender (national and cross-border), or directly selling services/products to public administrations.
definition: Questo evento della vita di un'impresa raggruppa servizi pubblici relativi alla partecipazione in appalti pubblici (nazionali e transfrontalieri) o alla vendita diretta di servizi/prodotti a pubbliche amministrazioni. @it
in scheme: business-event
notation: 15
preferred label: Partecipazione ad appalti pubblici nazionali e trasfrontalieri @it
preferred label: Teilnahme am öffentlichen Beschaffungswesen (national und grenzüberschreitend) @de
has rank order: 1